{"text_format":"1","workbook":"xlsx","n_sheets":16,"sheets":["MainMenu","Technologies Intro","Chlorination","RoughingFilter","C&F","Sedimentation","RSF","UserInterface","Matrix","Requirements of Technology","Quality Standard","Evaluation","Data","Recommendation","VendorQuestions","Costs"],"not_rendered":{"charts":0,"images":28,"macros":1,"external_links":1,"defined_names":38,"comments":0,"pivot_tables":0},"unopened":[],"bounds":{"document_bytes":16777216,"sheet_cells":100000,"rows_first":2000,"rows_last":500,"rows_between":2000,"halvings":0,"cell_chars":16384,"cell_head_chars":4096},"cells_cut":0,"cells_raw":0,"read":"whole","date_system":"1900"}

{"sheet":"MainMenu","index":0,"n_rows":0,"n_cols":0,"rows_kept":0,"cut":false,"hidden":false,"merged":[]}

{"sheet":"Technologies Intro","index":1,"n_rows":0,"n_cols":0,"rows_kept":0,"cut":false,"hidden":true,"merged":[]}

{"sheet":"Chlorination","index":2,"n_rows":0,"n_cols":0,"rows_kept":0,"cut":false,"hidden":true,"merged":[]}

{"sheet":"RoughingFilter","index":3,"n_rows":0,"n_cols":0,"rows_kept":0,"cut":false,"hidden":true,"merged":[]}

{"sheet":"C&F","index":4,"n_rows":0,"n_cols":0,"rows_kept":0,"cut":false,"hidden":true,"merged":[]}

{"sheet":"Sedimentation","index":5,"n_rows":0,"n_cols":0,"rows_kept":0,"cut":false,"hidden":true,"merged":[]}

{"sheet":"RSF","index":6,"n_rows":0,"n_cols":0,"rows_kept":0,"cut":false,"hidden":true,"merged":[]}

{"sheet":"UserInterface","index":7,"n_rows":123,"n_cols":12,"rows_kept":123,"cut":false,"hidden":true,"merged":[[120,9,120,12],[121,9,121,12],[122,9,122,12],[53,8,53,9],[79,8,79,9],[104,9,104,12],[105,9,105,12],[106,9,106,12],[89,5,89,8],[90,5,90,8],[91,5,91,8],[92,5,92,8],[93,5,93,8],[94,5,94,8],[95,5,95,8],[96,5,96,8],[118,3,118,5],[118,7,118,8],[48,8,48,9],[49,8,49,9],[108,9,108,12],[60,8,60,9],[74,8,74,9],[75,8,75,9],[76,8,76,9],[77,8,77,9],[78,8,78,9],[81,8,81,12],[57,4,57,5],[58,4,58,5],[53,4,53,5],[97,5,97,8],[0,0,0,13],[5,3,5,8],[6,3,6,8],[7,3,7,8],[8,3,8,8],[98,5,98,8],[9,3,9,8],[54,8,54,9],[55,8,55,9],[56,8,56,9],[31,8,31,9],[54,4,54,5],[55,4,55,5],[56,4,56,5]]}
["Water Treatment Technology Selection Guide"]
[]
[]
[null,"Who Are You?"]
[]
[null,"Name:",null,"Bart Simpson"]
[null,"Occupation / Designation:"]
[null,"Country:"]
[null,"State:"]
[null,"City:",null,"Springfield"]
{"$rows_left_out":114}
{"sheet":"Matrix","index":8,"n_rows":68,"n_cols":16,"rows_kept":68,"cut":false,"hidden":true,"merged":[]}
["Category","User Interface Data","Unit","Boolean/Scale Interpretation","Weighted Score","Option 1:\nChlorination","Option 2:\nStacked Rapid Sand Filtration + Chlorination","Option 3:\nRoughing Filter + Stacked Rapid Sand Filtration + Chlorination","Option 4:\nCoagulation + Flocculation + Stacked Rapid Sand Filtration + Chlorination","Option 5:\nCoagulation + Flocculation + Sedimentation + Chlorination","Option 6:\nCoagulation + Flocculation + Sedimentation + Stacked Rapid Sand Filtration + Chlorination","Option 7: Stacked Rapid Sand Filtration","Option 8: Roughing Filter + Stacked Rapid Sand Filtration","Option 9: Coagulation + Flocculation + Stacked Rapid Sand Filtration","Option 10: Coagulation + Flocculation + Sedimentation","Option 11:\nCoagulation + Flocculation + Sedimentation + Stacked Rapid Sand Filtration"]
["Raw Water Source"]
["Volume of Water Required",{"$f":"UserInterface!I17*UserInterface!I18","v":900000},"litres/day",{"$f":"B3","v":900000}]
["Volume Collected (Normal)",{"$f":"UserInterface!I21","v":1000000},"litres/day",{"$f":"B4","v":1000000}]
["Volume Collected (Dry Season)",{"$f":"UserInterface!C23/100*UserInterface!I21","v":400000},"litres/day",400000]
["Volume Collected (Wet Season)",{"$f":"UserInterface!C25/100*UserInterface!I21","v":1500000},"litres/day",1500000]
[]
["Water Quality"]
["Turbidity",{"$f":"IF(LEFT(UserInterface!I32,7)=\"Picture\",VALUE(MID(UserInterface!I32,13,3)),UserInterface!I37)","v":25},"NTU",{"$f":"IF(B9>0,1,0)","v":1},100,0,1,1,1,1,1,1,1,1,1,1]
["Algae",{"$f":"UserInterface!F42","v":"No"},"Boolean",{"$f":"IF(B10=\"Yes\",1,0)","v":0},{"$f":"D10*25","v":0},0,1,1,0,1,1,1,1,1,1,1]
{"$rows_left_out":59}
{"sheet":"Requirements of Technology","index":9,"n_rows":26,"n_cols":13,"rows_kept":26,"cut":false,"hidden":true,"merged":[]}
[null,null,"Option 1:\nChlorination","Option 2:\nStacked Rapid Sand Filtration + Chlorination","Option 3:\nRoughing Filter + Stacked Rapid Sand Filtration + Chlorination","Option 4:\nDirect Filtration + Chlorination","Option 5:\nCoagulation + Flocculation + Sedimentation + Chlorination","Option 6:\nCoagulation + Flocculation + Sedimentation + Stacked Rapid Sand Filtration + Chlorination","Option 7: Stacked Rapid Sand Filtration","Option 8: Roughing Filter + Stacked Rapid Sand Filtration","Option 9: Coagulation + Flocculation + Stacked Rapid Sand Filtration","Option 10: Coagulation + Flocculation + Sedimentation","Option 11:\nCoagulation + Flocculation + Sedimentation + Stacked Rapid Sand Filtration"]
[null,"Resources Requirements"]
[null,"Chlorine",1,1,1,1,1,1,0,0,0,0,0]
[null,"PACl",0,0,0,1,1,1,0,0,1,1,1]
[null,"Alum",0,0,0,1,1,1,0,0,1,1,1]
[null,"Ferric Chloride",0,0,0,1,1,1,0,0,1,1,1]
[null,"Sand",0,1,1,1,1,1,1,1,1,1,1]
[null,"Gravel",0,1,1,1,1,1,1,1,1,1,1]
[null,"Cement",0,1,1,1,1,1,1,1,1,1,1]
[null,"Bricks",0,1,1,1,1,1,1,1,1,1,1]
{"$rows_left_out":17}
{"sheet":"Quality Standard","index":10,"n_rows":30,"n_cols":12,"rows_kept":30,"cut":false,"hidden":true,"merged":[]}
[null,"1 - WHO","2 - US-EPA","3- Local Standards","Units","Unit Treatment Process 1:\nChlorination","Unit Treatment Process 2:\nStacked Rapid Sand Filtration","Unit Treatment Process 3: Coagulation, Floccuation and Sedimentation","Unit Treatment Process 4: Coagulation, Flocculation and Stacked Rapid Sand Filtration","Unit Treatment Process 5: Roughing Filter"]
["Turbidity",5,0.3,{"$f":"UserInterface!D73","v":0},"NTU",0,0.7,{"$f":"AVERAGE(80%,89%)","v":0.84499999999999997},0.97,{"$f":"AVERAGE(60%,90%)","v":0.75}]
["Protozoa: Cryptosporidium",{"$f":"1.3*10^-5","v":1.3000000000000001E-5},0,{"$f":"UserInterface!D78","v":0},"Organisms/Liter",0,0.7,{"$f":"AVERAGE(90%,95%)","v":0.92500000000000004},0.999,{"$f":"AVERAGE(60%,90%)","v":0.75}]
["Bacteria: Total Coliform",0,0,{"$f":"UserInterface!D79","v":0},"Organisms/Liter",0.999,{"$f":"AVERAGE(1%,50%)","v":0.255},{"$f":"AVERAGE(90%,95%)","v":0.92500000000000004},0.96,{"$f":"AVERAGE(93%,99.5%)","v":0.96250000000000002}]
["Virus: Rotavirus",{"$f":"1.1*10^-5","v":1.1000000000000001E-5},0,{"$f":"UserInterface!D80","v":0},"Organisms/Liter",0.999,{"$f":"AVERAGE(1%,50%)","v":0.255},0.92500000000000004,0.874,0]
["Cadmium",3.0000000000000001E-3,5.0000000000000001E-3,{"$f":"UserInterface!K73","v":0},"mg/L",0,0,0.7,0.7,0]
["Total Chromium",0.05,0.1,{"$f":"UserInterface!K74","v":0},"mg/L",0,0,0.9,0.9,0]
["Mercury",6.0000000000000001E-3,2E-3,{"$f":"UserInterface!K75","v":0},"mg/L",0,0,0.7,0.7,0]
["Selenium",0.04,0.05,{"$f":"UserInterface!K76","v":0},"mg/L",0,0,{"$f":"AVERAGE(40%,80%)","v":0.60000000000000009},{"$f":"AVERAGE(40%,80%)","v":0.60000000000000009},0]
[]
{"$rows_left_out":21}
{"sheet":"Evaluation","index":11,"n_rows":24,"n_cols":14,"rows_kept":24,"cut":false,"hidden":true,"merged":[]}
["Score","Option 1:  Chlorination","Option 2:  Stacked Rapid Sand Filtration - Chlorination","Option 3:  Roughing Filter - Stacked Rapid Sand Filtration - Chlorination","Option 4:  Coagulation & Flocculation - Stacked Rapid Sand Filtration - Chlorination","Option 5:  Coagulation & Flocculation - Sedimentation - Chlorination","Option 6:  Coagulation & Flocculation - Sedimentation - Stacked Rapid Sand Filtration - Chlorination","Option 7:  Stacked Rapid Sand Filtration","Option 8:  Roughing Filter - Stacked Rapid Sand Filtration","Option 9:  Coagulation & Flocculation - Stacked Rapid Sand Filtration","Option 10: Coagulation & Flocculation - Sedimentation","Option 11: Coagulation & Flocculation - Sedimentation - Stacked Rapid Sand Filtration","System Max Score","Weightage (%)"]
["Contaminant Removal Ability Score",{"$f":"(SUMPRODUCT(Matrix!$E$9:$E$10,Matrix!F9:F10)+SUMPRODUCT(Matrix!$E$15:$E$17,Matrix!F15:F17)+SUMPRODUCT(Matrix!$D$18:$D$27,Matrix!$E$18:$E$27,Matrix!F18:F27))/$M$2*$N$2","v":3.28125},{"$f":"(SUMPRODUCT(Matrix!$E$9:$E$10,Matrix!G9:G10)+SUMPRODUCT(Matrix!$E$15:$E$17,Matrix!G15:G17)+SUMPRODUCT(Matrix!$D$18:$D$27,Matrix!$E$18:$E$27,Matrix!G18:G27))/$M$2*$N$2","v":7.65625},{"$f":"(SUMPRODUCT(Matrix!$E$9:$E$10,Matrix!H9:H10)+SUMPRODUCT(Matrix!$E$15:$E$17,Matrix!H15:H17)+SUMPRODUCT(Matrix!$D$18:$D$27,Matrix!$E$18:$E$27,Matrix!H18:H27))/$M$2*$N$2","v":7.65625},{"$f":"(SUMPRODUCT(Matrix!$E$9:$E$10,Matrix!I9:I10)+SUMPRODUCT(Matrix!$E$15:$E$17,Matrix!I15:I17)+SUMPRODUCT(Matrix!$D$18:$D$27,Matrix!$E$18:$E$27,Matrix!I18:I27))/$M$2*$N$2","v":7.65625},{"$f":"(SUMPRODUCT(Matrix!$E$9:$E$10,Matrix!J9:J10)+SUMPRODUCT(Matrix!$E$15:$E$17,Matrix!J15:J17)+SUMPRODUCT(Matrix!$D$18:$D$27,Matrix!$E$18:$E$27,Matrix!J18:J27))/$M$2*$N$2","v":7.65625},{"$f":"(SUMPRODUCT(Matrix!$E$9:$E$10,Matrix!K9:K10)+SUMPRODUCT(Matrix!$E$15:$E$17,Matrix!K15:K17)+SUMPRODUCT(Matrix!$D$18:$D$27,Matrix!$E$18:$E$27,Matrix!K18:K27))/$M$2*$N$2","v":7.65625},{"$f":"(SUMPRODUCT(Matrix!$E$9:$E$10,Matrix!L9:L10)+SUMPRODUCT(Matrix!$E$15:$E$17,Matrix!L15:L17)+SUMPRODUCT(Matrix!$D$18:$D$27,Matrix!$E$18:$E$27,Matrix!L18:L27))/$M$2*$N$2","v":7.65625},{"$f":"(SUMPRODUCT(Matrix!$E$9:$E$10,Matrix!M9:M10)+SUMPRODUCT(Matrix!$E$15:$E$17,Matrix!M15:M17)+SUMPRODUCT(Matrix!$D$18:$D$27,Matrix!$E$18:$E$27,Matrix!M18:M27))/$M$2*$N$2","v":7.65625},{"$f":"(SUMPRODUCT(Matrix!$E$9:$E$10,Matrix!N9:N10)+SUMPRODUCT(Matrix!$E$15:$E$17,Matrix!N15:N17)+SUMPRODUCT(Matrix!$D$18:$D$27,Matrix!$E$18:$E$27,Matrix!N18:N27))/$M$2*$N$2","v":7.65625},{"$f":"(SUMPRODUCT(Matrix!$E$9:$E$10,Matrix!O9:O10)+SUMPRODUCT(Matrix!$E$15:$E$17,Matrix!O15:O17)+SUMPRODUCT(Matrix!$D$18:$D$27,Matrix!$E$18:$E$27,Matrix!O18:O27))/$M$2*$N$2","v":7.65625},{"$f":"(SUMPRODUCT(Matrix!$E$9:$E$10,Matrix!P9:P10)+SUMPRODUCT(Matrix!$E$15:$E$17,Matrix!P15:P17)+SUMPRODUCT(Matrix!$D$18:$D$27,Matrix!$E$18:$E$27,Matrix!P18:P27))/$M$2*$N$2","v":7.65625},{"$f":"Matrix!E9+Matrix!E10+SUM(Matrix!E15:E39)","v":800},35]
["Actual Removal Performance Score",{"$f":"(Matrix!$E$30*Matrix!F30+SUMPRODUCT(Matrix!$E$33:$E$39,Matrix!F33:F39))/$M$3*$N$3","v":11.666666666666666},{"$f":"(Matrix!$E$30*Matrix!G30+SUMPRODUCT(Matrix!$E$33:$E$39,Matrix!G33:G39))/$M$3*$N$3","v":11.666666666666666},{"$f":"(Matrix!$E$30*Matrix!H30+SUMPRODUCT(Matrix!$E$33:$E$39,Matrix!H33:H39))/$M$3*$N$3","v":32.666666666666664},{"$f":"(Matrix!$E$30*Matrix!I30+SUMPRODUCT(Matrix!$E$33:$E$39,Matrix!I33:I39))/$M$3*$N$3","v":32.666666666666664},{"$f":"(Matrix!$E$30*Matrix!J30+SUMPRODUCT(Matrix!$E$33:$E$39,Matrix!J33:J39))/$M$3*$N$3","v":32.666666666666664},{"$f":"(Matrix!$E$30*Matrix!K30+SUMPRODUCT(Matrix!$E$33:$E$39,Matrix!K33:K39))/$M$3*$N$3","v":32.666666666666664},{"$f":"(Matrix!$E$30*Matrix!L30+SUMPRODUCT(Matrix!$E$33:$E$39,Matrix!L33:L39))/$M$3*$N$3","v":9.3333333333333339},{"$f":"(Matrix!$E$30*Matrix!M30+SUMPRODUCT(Matrix!$E$33:$E$39,Matrix!M33:M39))/$M$3*$N$3","v":30.333333333333336},{"$f":"(Matrix!$E$30*Matrix!N30+SUMPRODUCT(Matrix!$E$33:$E$39,Matrix!N33:N39))/$M$3*$N$3","v":30.333333333333336},{"$f":"(Matrix!$E$30*Matrix!O30+SUMPRODUCT(Matrix!$E$33:$E$39,Matrix!O33:O39))/$M$3*$N$3","v":32.666666666666664},{"$f":"(Matrix!$E$30*Matrix!P30+SUMPRODUCT(Matrix!$E$33:$E$39,Matrix!P33:P39))/$M$3*$N$3","v":32.666666666666664},{"$f":"Matrix!E30+SUM(Matrix!E33:E39)","v":375},35]
["Resources Requirement Score",{"$f":"(SUMPRODUCT(Matrix!$D$42:$D$51/4,Matrix!$E$42:$E$51,Matrix!F42:F51,'Requirements of Technology'!C3:C12)+SUMPRODUCT(Matrix!$E$52:$E$56,Matrix!F52:F56))/'Requirements of Technology'!C18*Evaluation!$N$4","v":10},{"$f":"(SUMPRODUCT(Matrix!$D$42:$D$51/4,Matrix!$E$42:$E$51,Matrix!G42:G51,'Requirements of Technology'!D3:D12)+SUMPRODUCT(Matrix!$E$52:$E$56,Matrix!G52:G56))/'Requirements of Technology'!D18*Evaluation!$N$4","v":10},{"$f":"(SUMPRODUCT(Matrix!$D$42:$D$51/4,Matrix!$E$42:$E$51,Matrix!H42:H51,'Requirements of Technology'!E3:E12)+SUMPRODUCT(Matrix!$E$52:$E$56,Matrix!H52:H56))/'Requirements of Technology'!E18*Evaluation!$N$4","v":10},{"$f":"(SUMPRODUCT(Matrix!$D$42:$D$51/4,Matrix!$E$42:$E$51,Matrix!I42:I51,'Requirements of Technology'!F3:F12)+SUMPRODUCT(Matrix!$E$52:$E$56,Matrix!I52:I56))/'Requirements of Technology'!F18*Evaluation!$N$4","v":7.333333333333333},{"$f":"(SUMPRODUCT(Matrix!$D$42:$D$51/4,Matrix!$E$42:$E$51,Matrix!J42:J51,'Requirements of Technology'!G3:G12)+SUMPRODUCT(Matrix!$E$52:$E$56,Matrix!J52:J56))/'Requirements of Technology'!G18*Evaluation!$N$4","v":7.333333333333333},{"$f":"(SUMPRODUCT(Matrix!$D$42:$D$51/4,Matrix!$E$42:$E$51,Matrix!K42:K51,'Requirements of Technology'!H3:H12)+SUMPRODUCT(Matrix!$E$52:$E$56,Matrix!K52:K56))/'Requirements of Technology'!H18*Evaluation!$N$4","v":7.333333333333333},{"$f":"(SUMPRODUCT(Matrix!$D$42:$D$51/4,Matrix!$E$42:$E$51,Matrix!L42:L51,'Requirements of Technology'!I3:I12)+SUMPRODUCT(Matrix!$E$52:$E$56,Matrix!L52:L56))/'Requirements of Technology'!I18*Evaluation!$N$4","v":10},{"$f":"(SUMPRODUCT(Matrix!$D$42:$D$51/4,Matrix!$E$42:$E$51,Matrix!M42:M51,'Requirements of Technology'!J3:J12)+SUMPRODUCT(Matrix!$E$52:$E$56,Matrix!M52:M56))/'Requirements of Technology'!J18*Evaluation!$N$4","v":10},{"$f":"(SUMPRODUCT(Matrix!$D$42:$D$51/4,Matrix!$E$42:$E$51,Matrix!N42:N51,'Requirements of Technology'!K3:K12)+SUMPRODUCT(Matrix!$E$52:$E$56,Matrix!N52:N56))/'Requirements of Technology'!K18*Evaluation!$N$4","v":7.1428571428571432},{"$f":"(SUMPRODUCT(Matrix!$D$42:$D$51/4,Matrix!$E$42:$E$51,Matrix!O42:O51,'Requirements of Technology'!L3:L12)+SUMPRODUCT(Matrix!$E$52:$E$56,Matrix!O52:O56))/'Requirements of Technology'!L18*Evaluation!$N$4","v":7.1428571428571432},{"$f":"(SUMPRODUCT(Matrix!$D$42:$D$51/4,Matrix!$E$42:$E$51,Matrix!P42:P51,'Requirements of Technology'!M3:M12)+SUMPRODUCT(Matrix!$E$52:$E$56,Matrix!P52:P56))/'Requirements of Technology'!M18*Evaluation!$N$4","v":7.1428571428571432},"Dependent",10]
["Community Preferences Score",{"$f":"SUMPRODUCT(Matrix!$E$59:$E$64,Matrix!F59:F64)/$M$5*$N$5","v":0},{"$f":"SUMPRODUCT(Matrix!$E$59:$E$64,Matrix!G59:G64)/$M$5*$N$5","v":0},{"$f":"SUMPRODUCT(Matrix!$E$59:$E$64,Matrix!H59:H64)/$M$5*$N$5","v":0},{"$f":"SUMPRODUCT(Matrix!$E$59:$E$64,Matrix!I59:I64)/$M$5*$N$5","v":1.875},{"$f":"SUMPRODUCT(Matrix!$E$59:$E$64,Matrix!J59:J64)/$M$5*$N$5","v":1.875},{"$f":"SUMPRODUCT(Matrix!$E$59:$E$64,Matrix!K59:K64)/$M$5*$N$5","v":1.875},{"$f":"SUMPRODUCT(Matrix!$E$59:$E$64,Matrix!L59:L64)/$M$5*$N$5","v":0},{"$f":"SUMPRODUCT(Matrix!$E$59:$E$64,Matrix!M59:M64)/$M$5*$N$5","v":0},{"$f":"SUMPRODUCT(Matrix!$E$59:$E$64,Matrix!N59:N64)/$M$5*$N$5","v":1.875},{"$f":"SUMPRODUCT(Matrix!$E$59:$E$64,Matrix!O59:O64)/$M$5*$N$5","v":1.875},{"$f":"SUMPRODUCT(Matrix!$E$59:$E$64,Matrix!P59:P64)/$M$5*$N$5","v":1.875},{"$f":"SUM(Matrix!E59:E64)","v":100},5]
["Costs",{"$f":"SUMPRODUCT(Matrix!F67:F68,Matrix!$E$67:$E$68)/$M$6*$N$6","v":14.549999999999999},{"$f":"SUMPRODUCT(Matrix!G67:G68,Matrix!$E$67:$E$68)/$M$6*$N$6","v":7.5750000000000002},{"$f":"SUMPRODUCT(Matrix!H67:H68,Matrix!$E$67:$E$68)/$M$6*$N$6","v":4.6500000000000004},{"$f":"SUMPRODUCT(Matrix!I67:I68,Matrix!$E$67:$E$68)/$M$6*$N$6","v":6.3},{"$f":"SUMPRODUCT(Matrix!J67:J68,Matrix!$E$67:$E$68)/$M$6*$N$6","v":9.9899999999999984},{"$f":"SUMPRODUCT(Matrix!K67:K68,Matrix!$E$67:$E$68)/$M$6*$N$6","v":8.5499999999999989},{"$f":"SUMPRODUCT(Matrix!L67:L68,Matrix!$E$67:$E$68)/$M$6*$N$6","v":8.2350000000000012},{"$f":"SUMPRODUCT(Matrix!M67:M68,Matrix!$E$67:$E$68)/$M$6*$N$6","v":5.1000000000000005},{"$f":"SUMPRODUCT(Matrix!N67:N68,Matrix!$E$67:$E$68)/$M$6*$N$6","v":7.4850000000000003},{"$f":"SUMPRODUCT(Matrix!O67:O68,Matrix!$E$67:$E$68)/$M$6*$N$6","v":10.440000000000001},{"$f":"SUMPRODUCT(Matrix!P67:P68,Matrix!$E$67:$E$68)/$M$6*$N$6","v":9},{"$f":"SUM(Matrix!E67:E68)","v":100},15]
["Percentage Score",{"$f":"SUM(B2:B6)","v":39.497916666666661},{"$f":"SUM(C2:C6)","v":36.897916666666667},{"$f":"SUM(D2:D6)","v":54.972916666666663},{"$f":"SUM(E2:E6)","v":55.831249999999997},{"$f":"SUM(F2:F6)+4","v":63.521249999999995},{"$f":"SUM(G2:G6)","v":58.081249999999997},{"$f":"SUM(H2:H6)","v":35.224583333333335},53.089583333333337,54.492440476190481,59.780773809523808,58.34077380952381,{"$f":"SUM(M2:M6)","v":1375}]
[]
[]
[null,"Score","Rank","Pre-Treatment","Main Treatment 1","Main Treatment 2","Main Treatment 3","Disinfection"]
{"$rows_left_out":15}
{"sheet":"Data","index":12,"n_rows":29,"n_cols":10,"rows_kept":29,"cut":false,"hidden":true,"merged":[]}
["Boolean",null,"Source of Raw Water",null,"DryFluctuations","WetFluctuations",null,"Color",null,"Treatment Standards"]
["Yes",null,"Groundwater",null,10,110,null,"Cloudy-white",null,"World Health Organization (WHO)"]
["No",null,"Lakes",null,20,120,null,"Yellow",null,"United States Environmental Protection Agency (US-EPA)"]
[null,null,"Rain Water",null,30,130,null,"Brown"]
["Availability",null,"Reservoir",null,40,140]
["Yes - Can be obtained within Community",4,"River",null,50,150]
["Yes - Can be obtained within 10km from Community",3,"Spring Water",null,60,160]
["Yes - Can be obtained > 10km away in Country",2,"Stream",null,70,170]
["Yes - Can be obtained from other countries",1,"Well Water",null,80,180]
["No  - Cannot be obtained easily",0,null,null,90,190]
{"$rows_left_out":20}
{"sheet":"Recommendation","index":13,"n_rows":48,"n_cols":10,"rows_kept":48,"cut":false,"hidden":true,"merged":[[3,5,3,7],[6,5,6,7],[12,5,12,7],[13,5,13,7],[14,5,14,7],[20,5,20,7],[11,5,11,7],[15,5,15,7],[11,3,12,3],[11,2,12,2],[11,9,12,9],[16,5,16,7],[17,5,17,7],[18,5,18,7],[19,5,19,7],[4,2,4,3],[43,1,43,4],[45,3,45,4],[47,1,47,2],[34,1,40,4],[46,3,46,4],[47,3,47,4],[42,1,42,4],[45,1,45,2],[46,1,46,2]]}
[]
[null,"Water Treatment Technology Selection Guide"]
[]
[null,null,null,null,"Pre-Treatment","Main Treatment",null,null,"Dis-infection"]
[null,null,"Top Recommendation"]
[]
[null,null,null,null,"Roughing Filter","Stacked Rapid Sand Filtration",null,null,"Chlorination"]
[]
[]
[]
{"$rows_left_out":39}
{"sheet":"VendorQuestions","index":14,"n_rows":19,"n_cols":2,"rows_kept":19,"cut":false,"hidden":true,"merged":[]}
[]
[]
[null,"Top 15 Questions to Ask Your Technology Vendor"]
[]
[null,"1. What is the track record of this equipment, where has it been used and what is the maximum capacity of the plant it has been used in? "]
[null,"2. Is there any reference I can contact to find out more about its performance?"]
[null,"3. Is this equipment/system certified for use in my country?"]
[null,"4. What is the expected lifetime of this equipment/system, and what is the length of warranty?"]
[null,"5. What does the warranty cover - material and/or service?"]
[null,"6. Can our operators perform maintenance tasks on the equipment on our own accord, or must we get qualified service personnel to carry out servicing?"]
{"$rows_left_out":10}
{"sheet":"Costs","index":15,"n_rows":35,"n_cols":12,"rows_kept":35,"cut":false,"hidden":true,"merged":[[5,1,5,5]]}
[]
[null,"Option 1: Chlorination","Option 2: Stacked Rapid Sand Filtration - Chlorination","Option 3: Roughing Filter - Stacked Rapid Sand Filtration - Chlorination","Option 4: Coagulation & Flocculation - Stacked Rapid Sand Filtration - Chlorination","Option 5: Coagulation & Flocculation - Sedimentation - Chlorination","Option 6: Coagulation & Flocculation - Sedimentation - Stacked Rapid Sand Filtration - Chlorination","Option 7: Stacked Rapid Sand Filtration","Option 8: Roughing Filter + Stacked Rapid Sand Filtration","Option 9: Coagulation + Flocculation + Stacked Rapid Sand Filtration","Option 10: Coagulation + Flocculation + Sedimentation","Option 11:\nCoagulation + Flocculation + Sedimentation + Stacked Rapid Sand Filtration"]
["Cost","LOW","MEDIUM","VERY HIGH","HIGH","HIGH","VERY HIGH","MEDIUM","VERY HIGH","HIGH","HIGH","VERY HIGH"]
[]
[]
[null,"Possible Combinations of UTPs",null,null,null,null,"CAPEX","OPEX","Corresponds to / because"]
[1,"None","None","None","None","None","Nil","Nil"]
[{"$f":"A7+1","v":2},"Roughing Filter","None","None","None","None","Very High","High","RF"]
[{"$f":"A8+1","v":3},"None","Stacked Rapid Sand Filtration","None","None","None","Medium","Medium",7]
[4,"None","Coagulation & Flocculation","Stacked Rapid Sand Filtration","None","None","High","High",9]
{"$rows_left_out":25}